Quantcast

make fails ... since 2 days

classic Classic list List threaded Threaded
3 messages Options
Reply | Threaded
Open this post in threaded view
|  
Report Content as Inappropriate

make fails ... since 2 days

sumitstop
Since 2 days I am trying to install GNU Radio with marcus scripts. UHD is getting installed perfectly but GNU Radio exits by saying "Make failed" ...

Then I tried doing it manually.
It failed there also.

Here is the error
~~~~~~~~~~~~~~~~~~~~~~~~~~~~~~~~~~~~~~~~~~~~~~~~~~~~~~~~~~~~~~~~~~~~~~~~~~~~~~~~~

/home/sumit/Downloads/gnuradio/build/gnuradio-core/src/lib/swig/gnuradio_core_generalPYTHON_wrap.cxx:5797: error: redefinition of ‘struct swig::traits<unsigned int>’
/home/sumit/Downloads/gnuradio/build/gnuradio-core/src/lib/swig/gnuradio_core_generalPYTHON_wrap.cxx:5217: error: previous definition of ‘struct swig::traits<unsigned int>’
/home/sumit/Downloads/gnuradio/build/gnuradio-core/src/lib/swig/gnuradio_core_generalPYTHON_wrap.cxx:5801: error: redefinition of ‘struct swig::traits_asval<unsigned int>’
/home/sumit/Downloads/gnuradio/build/gnuradio-core/src/lib/swig/gnuradio_core_generalPYTHON_wrap.cxx:5221: error: previous definition of ‘struct swig::traits_asval<unsigned int>’
/home/sumit/Downloads/gnuradio/build/gnuradio-core/src/lib/swig/gnuradio_core_generalPYTHON_wrap.cxx:5807: error: redefinition of ‘struct swig::traits_from<unsigned int>’
/home/sumit/Downloads/gnuradio/build/gnuradio-core/src/lib/swig/gnuradio_core_generalPYTHON_wrap.cxx:5227: error: previous definition of ‘struct swig::traits_from<unsigned int>’
/home/sumit/Downloads/gnuradio/build/gnuradio-core/src/lib/swig/gnuradio_core_generalPYTHON_wrap.cxx:5817: error: redefinition of ‘struct swig::traits<std::vector<unsigned int, std::allocator<unsigned int> > >’
/home/sumit/Downloads/gnuradio/build/gnuradio-core/src/lib/swig/gnuradio_core_generalPYTHON_wrap.cxx:5237: error: previous definition of ‘struct swig::traits<std::vector<unsigned int, std::allocator<unsigned int> > >’
make[2]: *** [gnuradio-core/src/lib/swig/CMakeFiles/_gnuradio_core_general.dir/gnuradio_core_generalPYTHON_wrap.cxx.o] Error 1
make[1]: *** [gnuradio-core/src/lib/swig/CMakeFiles/_gnuradio_core_general.dir/all] Error 2
make: *** [all] Error 2

~~~~~~~~~~~~~~~~~~~~~~~~~~~~~~~~~~~~~~~~~~~~~~~~~~~~~~~~~~~~~~~~~~~~~~~~~~~~~~~~~

Any pointers.


Reply | Threaded
Open this post in threaded view
|  
Report Content as Inappropriate

Re: make fails ... since 2 days

sumitstop
Some additional details.
OS : Ubuntu 10.04
cmake : 2.8.0-5
boost : 1.40
cppunit : 1.12-1
fftw : 3.2.2-1
python : 2.6.5
swig : 1.3.40
~~~~~~~~~~~~~~~~~~~~~~~~~~~~~~
Just 10 days ago I got all the things properly installed with the same settings.
Reply | Threaded
Open this post in threaded view
|  
Report Content as Inappropriate

Re: make fails ... since 2 days

Marcus D. Leech
On 03/29/2013 03:39 AM, sumitstop wrote:

> Some additional details.
> OS : Ubuntu 10.04
> cmake : 2.8.0-5
> boost : 1.40
> cppunit : 1.12-1
> fftw : 3.2.2-1
> python : 2.6.5
> swig : 1.3.40
> ~~~~~~~~~~~~~~~~~~~~~~~~~~~~~~
> Just 10 days ago I got all the things properly installed with the same
> settings.
>
>
>
> --
> View this message in context: http://gnuradio.4.n7.nabble.com/make-fails-since-2-days-tp40407p40410.html
> Sent from the GnuRadio mailing list archive at Nabble.com.
>
> _______________________________________________
> Discuss-gnuradio mailing list
> [hidden email]
> https://lists.gnu.org/mailman/listinfo/discuss-gnuradio
>
>
This is a current problem with 32-bit builds, and I believe that Tom is
working on it.


--
Marcus Leech
Principal Investigator
Shirleys Bay Radio Astronomy Consortium
http://www.sbrac.org



_______________________________________________
Discuss-gnuradio mailing list
[hidden email]
https://lists.gnu.org/mailman/listinfo/discuss-gnuradio
Loading...